Reaction Details
TargetNeuropeptide Y receptor type 1
LigandBDBM50441964
Substrate/Competitorn/a
Meas. Tech.ChEMBL_992054 (CHEMBL2447455)
Ki>1000±n/a nM
Citation Berlicki, LKaske, MGutièrrez-Abad, RBernhardt, GIlla, OOrtuno, RMCabrele, CBuschauer, AReiser, O Replacement of Thr32 and Gln34 in the C-terminal neuropeptide Y fragment 25-36 by cis-cyclobutane and cis-cyclopentane β-amino acids shifts selectivity toward the Y(4) receptor. J Med Chem56:8422-31 (2013) 
 
Neuropeptide Y receptor type 1
Name:Neuropeptide Y receptor type 1
Type:Enzyme Catalytic Domain
Mol. Mass.:44399.07
Organism:Homo sapiens (Human)
Description:NPY-Y1 NPY1R HUMAN::P25929
Residue:384
BDBM50441964
NameBDBM50441964
Synonyms:CHEMBL2440193
TypeSmall organic molecule
Emp. Form.C80H127N25O16
Mol. Mass.1695.0223
SMILESCC[C@H](C)[C@H](NC(=O)[C@H](Cc1ccc(O)cc1)NC(=O)[C@H](Cc1cnc[nH]1)NC(=O)[C@H](CCCN=C(N)N)NC(C)=O)C(=O)N[C@@H](CC(N)=O)C(=O)N[C@@H](CC(C)C)C(=O)N[C@@H]([C@@H](C)CC)C(=O)N[C@@H]1C[C@H](C(=O)N[C@@H](CCCN=C(N)N)C(=O)N[C@@H]2C[C@H](C(=O)N[C@@H](CCCNC(N)=N)C(=O)N[C@@H](Cc3ccc(O)cc3)C(N)=O)C2(C)C)C1(C)C