Reaction Details
TargetNeuropeptide Y receptor type 4
LigandBDBM50441957
Substrate/Competitorn/a
Meas. Tech.ChEMBL_992059 (CHEMBL2447702)
Ki 50±n/a nM
Citation Berlicki, LKaske, MGutièrrez-Abad, RBernhardt, GIlla, OOrtuno, RMCabrele, CBuschauer, AReiser, O Replacement of Thr32 and Gln34 in the C-terminal neuropeptide Y fragment 25-36 by cis-cyclobutane and cis-cyclopentane β-amino acids shifts selectivity toward the Y(4) receptor. J Med Chem56:8422-31 (2013) 
 
Neuropeptide Y receptor type 4
Name:Neuropeptide Y receptor type 4
Type:Enzyme Catalytic Domain
Mol. Mass.:42207.58
Organism:Homo sapiens (Human)
Description:NPY-Y4 PPYR1 HUMAN::P50391
Residue:375
BDBM50441957
NameBDBM50441957
Synonyms:CHEMBL2440199
TypeSmall organic molecule
Emp. Form.C38H58N12O8
Mol. Mass.810.9427
SMILES[#6]-[#6](-[#6])-[#6]-[#6@H](-[#7]-[#6](=O)-[#6@H](-[#6]-[#6]-[#6]\[#7]=[#6](/[#7])-[#7])-[#7]-[#6](=O)-[#6@H](-[#6]-c1ccc(-[#8])cc1)-[#7]-[#6](-[#6])=O)-[#6](=O)-[#7]-[#6@@H](-[#6]-[#6]-[#6]\[#7]=[#6](/[#7])-[#7])-[#6](=O)-[#7]-[#6@@H](-[#6]-c1ccc(-[#8])cc1)-[#6](-[#7])=O