Reaction Details
TargetNeuropeptide Y receptor type 4
LigandBDBM50441958
Substrate/Competitorn/a
Meas. Tech.ChEMBL_992059 (CHEMBL2447702)
Ki 509±n/a nM
Citation Berlicki, LKaske, MGutièrrez-Abad, RBernhardt, GIlla, OOrtuno, RMCabrele, CBuschauer, AReiser, O Replacement of Thr32 and Gln34 in the C-terminal neuropeptide Y fragment 25-36 by cis-cyclobutane and cis-cyclopentane β-amino acids shifts selectivity toward the Y(4) receptor. J Med Chem56:8422-31 (2013) 
 
Neuropeptide Y receptor type 4
Name:Neuropeptide Y receptor type 4
Type:Enzyme Catalytic Domain
Mol. Mass.:42207.58
Organism:Homo sapiens (Human)
Description:NPY-Y4 PPYR1 HUMAN::P50391
Residue:375
BDBM50441958
NameBDBM50441958
Synonyms:CHEMBL2440119
TypeSmall organic molecule
Emp. Form.C33H54N12O8
Mol. Mass.746.8575
SMILESC[C@@H](O)[C@H](NC(C)=O)C(=O)N[C@@H](CCCNC(N)=N)C(=O)N[C@H]1CCC[C@H]1C(=O)N[C@@H](CCCNC(N)=N)C(=O)N[C@@H](Cc1ccc(O)cc1)C(N)=O