Reaction Details
TargetSqualene synthase
LigandBDBM50442114
Substrate/Competitorn/a
Meas. Tech.ChEMBL_993092 (CHEMBL2446442)
IC50 0.360000±n/a nM
Citation Ichikawa, MOhtsuka, MOhki, HOta, MHaginoya, NItoh, MShibata, YIshigai, YTerayama, KKanda, ASugita, KUsui, H Discovery of DF-461, a Potent Squalene Synthase Inhibitor. ACS Med Chem Lett4:932-6 (2013) 
 
Squalene synthase
Name:Squalene synthase
Type:PROTEIN
Mol. Mass.:48109.41
Organism:Rattus norvegicus
Description:ChEMBL_1336736
Residue:416
BDBM50442114
NameBDBM50442114
Synonyms:CHEMBL2441090
TypeSmall organic molecule
Emp. Form.C22H19ClF3N3O4
Mol. Mass.481.852
SMILESCCc1c(OC)cccc1[C@H]1O[C@H](CC(O)=O)c2nnc(n2-c2ccc(Cl)cc12)C(F)(F)F