Reaction Details
TargetEukaryotic translation initiation factor 2-alpha kinase 1
LigandBDBM50442166
Substrate/Competitorn/a
Meas. Tech.ChEMBL_993291 (CHEMBL2443948)
IC50 460±n/a nM
Citation Axten, JMRomeril, SPShu, ARalph, JMedina, JRFeng, YLi, WHGrant, SWHeerding, DAMinthorn, EMencken, TGaul, NGoetz, AStanley, THassell, AMGampe, RTAtkins, CKumar, R Discovery of GSK2656157: An Optimized PERK Inhibitor Selected for Preclinical Development. ACS Med Chem Lett4:964-8 (2013) 
 
Eukaryotic translation initiation factor 2-alpha kinase 1
Name:Eukaryotic translation initiation factor 2-alpha kinase 1
Type:PROTEIN
Mol. Mass.:71098.55
Organism:Homo sapiens (Human)
Description:ChEMBL_1467744
Residue:630
BDBM50442166
NameBDBM50442166
Synonyms:CHEMBL2441340
TypeSmall organic molecule
Emp. Form.C23H21FN6O
Mol. Mass.416.4508
SMILESCc1cccc(CC(=O)N2CCc3c2ccc(-c2cn(C)c4ncnc(N)c24)c3F)n1