Reaction Details
TargetPlatelet-derived growth factor receptor alpha
LigandBDBM50442259
Substrate/Competitorn/a
Meas. Tech.ChEMBL_991998 (CHEMBL2447153)
IC50>1000±n/a nM
Citation Zhang, DZhang, XAi, JZhai, YLiang, ZWang, YChen, YLi, CZhao, FJiang, HGeng, MLuo, CLiu, H Synthesis and biological evaluation of 2-amino-5-aryl-3-benzylthiopyridine scaffold based potent c-Met inhibitors. Bioorg Med Chem21:6804-20 (2013) 
 
Platelet-derived growth factor receptor alpha
Name:Platelet-derived growth factor receptor alpha
Type:Protein
Mol. Mass.:122633.38
Organism:Homo sapiens (Human)
Description:P16234
Residue:1089
BDBM50442259
NameBDBM50442259
Synonyms:CHEMBL2442124
TypeSmall organic molecule
Emp. Form.C21H22Cl2FN5S
Mol. Mass.466.402
SMILESC[C@@H](Sc1cc(cnc1N)-c1cnn(c1)C1CCNCC1)c1c(Cl)ccc(F)c1Cl