Reaction Details
TargetTyrosine-protein kinase receptor UFO
LigandBDBM50442259
Substrate/Competitorn/a
Meas. Tech.ChEMBL_992001 (CHEMBL2447156)
IC50 447±n/a nM
Citation Zhang, DZhang, XAi, JZhai, YLiang, ZWang, YChen, YLi, CZhao, FJiang, HGeng, MLuo, CLiu, H Synthesis and biological evaluation of 2-amino-5-aryl-3-benzylthiopyridine scaffold based potent c-Met inhibitors. Bioorg Med Chem21:6804-20 (2013) 
 
Tyrosine-protein kinase receptor UFO
Name:Tyrosine-protein kinase receptor UFO
Type:Enzyme
Mol. Mass.:98316.97
Organism:Homo sapiens (Human)
Description:P30530
Residue:894
BDBM50442259
NameBDBM50442259
Synonyms:CHEMBL2442124
TypeSmall organic molecule
Emp. Form.C21H22Cl2FN5S
Mol. Mass.466.402
SMILESC[C@@H](Sc1cc(cnc1N)-c1cnn(c1)C1CCNCC1)c1c(Cl)ccc(F)c1Cl