Reaction Details
TargetHepatocyte growth factor receptor
LigandBDBM50442278
Substrate/Competitorn/a
Meas. Tech.ChEMBL_992003 (CHEMBL2447158)
IC50 38±n/a nM
Citation Zhang, DZhang, XAi, JZhai, YLiang, ZWang, YChen, YLi, CZhao, FJiang, HGeng, MLuo, CLiu, H Synthesis and biological evaluation of 2-amino-5-aryl-3-benzylthiopyridine scaffold based potent c-Met inhibitors. Bioorg Med Chem21:6804-20 (2013) 
 
Hepatocyte growth factor receptor
Name:Hepatocyte growth factor receptor
Type:Protein
Mol. Mass.:155559.73
Organism:Homo sapiens (Human)
Description:P08581
Residue:1390
BDBM50442278
NameBDBM50442278
Synonyms:CHEMBL2442134
TypeSmall organic molecule
Emp. Form.C23H24Cl2FN5O2S
Mol. Mass.524.438
SMILESCC(Sc1cc(cnc1N)-c1cnn(c1)C1CCN(CC1)C(=O)CO)c1c(Cl)ccc(F)c1Cl