Reaction Details
TargetTransient receptor potential cation channel subfamily V member 1
LigandBDBM50442393
Substrate/Competitorn/a
Meas. Tech.ChEMBL_991133 (CHEMBL2446589)
Ki 0.70±n/a nM
Citation Ha, THRyu, HKim, SEKim, HSAnn, JTran, PTHoang, VHSon, KCui, MChoi, SBlumberg, PMFrank, RBahrenberg, GSchiene, KChristoph, TFrormann, SLee, J TRPV1 antagonist with high analgesic efficacy: 2-Thio pyridine C-region analogues of 2-(3-fluoro-4-methylsulfonylaminophenyl)propanamides. Bioorg Med Chem21:6657-64 (2013) 
 
Transient receptor potential cation channel subfamily V member 1
Name:Transient receptor potential cation channel subfamily V member 1
Type:Protein
Mol. Mass.:94960.75
Organism:Homo sapiens (Human)
Description:Q8NER1
Residue:839
BDBM50442393
NameBDBM50442393
Synonyms:CHEMBL2442894
TypeSmall organic molecule
Emp. Form.C21H25F4N3O3S2
Mol. Mass.507.565
SMILESCCCCSc1nc(ccc1CNC(=O)C(C)c1ccc(NS(C)(=O)=O)c(F)c1)C(F)(F)F