Reaction Details
TargetMetabotropic glutamate receptor 5
LigandBDBM50442525
Substrate/Competitorn/a
Meas. Tech.ChEMBL_990439 (CHEMBL2446290)
Ki 6.8±n/a nM
Citation Felts, ASRodriguez, ALMorrison, RDVenable, DFManka, JTBates, BSBlobaum, ALByers, FWDaniels, JSNiswender, CMJones, CKConn, PJLindsley, CWEmmitte, KA Discovery of VU0409106: A negative allosteric modulator of mGlu5 with activity in a mouse model of anxiety. Bioorg Med Chem Lett23:5779-85 (2013) 
 
Metabotropic glutamate receptor 5
Name:Metabotropic glutamate receptor 5
Type:Enzyme
Mol. Mass.:132484.72
Organism:Homo sapiens (Human)
Description:n/a
Residue:1212
BDBM50442525
NameBDBM50442525
Synonyms:CHEMBL2440659 | US8796295, Table 2: Compound: 1
TypeSmall organic molecule
Emp. Form.C15H11FN4O2S
Mol. Mass.330.337
SMILESCc1csc(NC(=O)c2cc(F)cc(Oc3cncnc3)c2)n1