Reaction Details
TargetHistamine receptor H3
LigandBDBM50442634
Substrate/Competitorn/a
Meas. Tech.ChEMBL_990753 (CHEMBL2443820)
Ki 58±n/a nM
Citation Gao, ZHurst, WJCzechtizky, WFrancon, DGriebel, GNagorny, RPichat, PSchwink, LStengelin, SHendrix, JAGeorge, PG Discovery of a potent, selective, and orally bioavailable histamine H3 receptor antagonist SAR110068 for the treatment of sleep-wake disorders. Bioorg Med Chem Lett23:6141-5 (2013) 
 
Histamine receptor H3
Name:Histamine receptor H3
Synonyms:n/a
Type:Enzyme
Mol. Mass.:48611.84
Organism:Macaca mulatta (Rhesus macaque)
Description:Q865E1
Residue:445
BDBM50442634
NameBDBM50442634
Synonyms:CHEMBL2441661
TypeSmall organic molecule
Emp. Form.C23H34N4O2
Mol. Mass.398.5417
SMILESCC1CCCN1C1CCN(C1)c1ccc(NC(=O)C2CCCN2C(C)=O)c(C)c1