Reaction Details
TargetHistamine receptor H3
LigandBDBM50442641
Substrate/Competitorn/a
Meas. Tech.ChEMBL_990753 (CHEMBL2443820)
Ki 66±n/a nM
Citation Gao, ZHurst, WJCzechtizky, WFrancon, DGriebel, GNagorny, RPichat, PSchwink, LStengelin, SHendrix, JAGeorge, PG Discovery of a potent, selective, and orally bioavailable histamine H3 receptor antagonist SAR110068 for the treatment of sleep-wake disorders. Bioorg Med Chem Lett23:6141-5 (2013) 
 
Histamine receptor H3
Name:Histamine receptor H3
Synonyms:n/a
Type:Enzyme
Mol. Mass.:48611.84
Organism:Macaca mulatta (Rhesus macaque)
Description:Q865E1
Residue:445
BDBM50442641
NameBDBM50442641
Synonyms:CHEMBL2441652
TypeSmall organic molecule
Emp. Form.C24H37N3O
Mol. Mass.383.5701
SMILESCC1CCCN1C1CCN(C1)c1ccc(NC(=O)C2C(C)(C)C2(C)C)cc1C