Reaction Details
TargetHistamine receptor H3
LigandBDBM50442644
Substrate/Competitorn/a
Meas. Tech.ChEMBL_990753 (CHEMBL2443820)
Ki 15±n/a nM
Citation Gao, ZHurst, WJCzechtizky, WFrancon, DGriebel, GNagorny, RPichat, PSchwink, LStengelin, SHendrix, JAGeorge, PG Discovery of a potent, selective, and orally bioavailable histamine H3 receptor antagonist SAR110068 for the treatment of sleep-wake disorders. Bioorg Med Chem Lett23:6141-5 (2013) 
 
Histamine receptor H3
Name:Histamine receptor H3
Synonyms:n/a
Type:Enzyme
Mol. Mass.:48611.84
Organism:Macaca mulatta (Rhesus macaque)
Description:Q865E1
Residue:445
BDBM50442644
NameBDBM50442644
Synonyms:CHEMBL2441648
TypeSmall organic molecule
Emp. Form.C20H26F3N3O
Mol. Mass.381.4351
SMILESCC1CCCN1C1CCN(C1)c1ccc(NC(=O)C2CC2)c(c1)C(F)(F)F