Reaction Details
TargetMonocarboxylate transporter 4
LigandBDBM50442714
Substrate/Competitorn/a
Meas. Tech.ChEMBL_989589 (CHEMBL2444904)
IC50 2300±n/a nM
Citation Draoui, NSchicke, OFernandes, ADrozak, XNahra, FDumont, ADouxfils, JHermans, EDogné, JMCorbau, RMarchand, AChaltin, PSonveaux, PFeron, ORiant, O Synthesis and pharmacological evaluation of carboxycoumarins as a new antitumor treatment targeting lactate transport in cancer cells. Bioorg Med Chem21:7107-17 (2013) 
 
Monocarboxylate transporter 4
Name:Monocarboxylate transporter 4
Type:PROTEIN
Mol. Mass.:49474.36
Organism:Homo sapiens (Human)
Description:ChEMBL_104604
Residue:465
BDBM50442714
NameBDBM50442714
Synonyms:CHEMBL1830821
TypeSmall organic molecule
Emp. Form.C11H8O5
Mol. Mass.220.1782
SMILESCOc1ccc2cc(C(O)=O)c(=O)oc2c1