Reaction Details
TargetHistone deacetylase 3
LigandBDBM50442727
Substrate/Competitorn/a
Meas. Tech.ChEMBL_989767 (CHEMBL2446005)
IC50 193±n/a nM
Citation Zhang, XBao, BYu, XTong, LLuo, YHuang, QSu, MSheng, LLi, JZhu, HYang, BZhang, XChen, YLu, W The discovery and optimization of novel dual inhibitors of topoisomerase II and histone deacetylase. Bioorg Med Chem21:6981-95 (2013) 
 
Histone deacetylase 3
Name:Histone deacetylase 3
Type:Enzyme
Mol. Mass.:48829.55
Organism:Homo sapiens (Human)
Description:O15379
Residue:428
BDBM50442727
NameBDBM50442727
Synonyms:CHEMBL2442791
TypeSmall organic molecule
Emp. Form.C31H32N2O10
Mol. Mass.592.5932
SMILESCOc1cc(cc(OC)c1O)[C@H]1[C@@H]2[C@H](COC2=O)[C@H](Nc2ccc(OCCCC(=O)NO)cc2)c2cc3OCOc3cc12