Reaction Details
TargetEctonucleotide pyrophosphatase/phosphodiesterase family member 1
LigandBDBM50315822
Substrate/Competitorn/a
Meas. Tech.ChEMBL_1276286 (CHEMBL3089713)
Ki 37000±n/a nM
Citation Lecka, JBen-David, GSimhaev, LEliahu, SOscar, JLuyindula, PPelletier, JFischer, BSenderowitz, HSévigny, J Nonhydrolyzable ATP analogues as selective inhibitors of human NPP1: a combined computational/experimental study. J Med Chem56:8308-20 (2013) 
 
Ectonucleotide pyrophosphatase/phosphodiesterase family member 1
Name:Ectonucleotide pyrophosphatase/phosphodiesterase family member 1
Type:PROTEIN
Mol. Mass.:104934.43
Organism:Homo sapiens (Human)
Description:ChEMBL_1448940
Residue:925
BDBM50315822
NameBDBM50315822
Synonyms:({[({[(2R,3S,4R,5R)-5-[6-amino-2-(methylsulfanyl)-9H-purin-9-yl]-3,4-dihydroxyoxolan-2-yl]methoxy}(hydroxy)phosphoryl)oxy](hydroxy)phosphoryl}difluoromethyl)phosphonic acid | CHEMBL1089560
TypeSmall organic molecule
Emp. Form.C12H18F2N5O12P3S
Mol. Mass.587.281
SMILESCSc1nc(N)c2ncn([C@@H]3O[C@H](COP(O)(=O)OP(O)(=O)C(F)(F)P(O)(O)=O)[C@@H](O)[C@H]3O)c2n1