Reaction Details
TargetEctonucleotide pyrophosphatase/phosphodiesterase family member 1
LigandBDBM50442938
Substrate/Competitorn/a
Meas. Tech.ChEMBL_1276286 (CHEMBL3089713)
Ki 7000±n/a nM
Citation Lecka, JBen-David, GSimhaev, LEliahu, SOscar, JLuyindula, PPelletier, JFischer, BSenderowitz, HSévigny, J Nonhydrolyzable ATP analogues as selective inhibitors of human NPP1: a combined computational/experimental study. J Med Chem56:8308-20 (2013) 
 
Ectonucleotide pyrophosphatase/phosphodiesterase family member 1
Name:Ectonucleotide pyrophosphatase/phosphodiesterase family member 1
Type:PROTEIN
Mol. Mass.:104934.43
Organism:Homo sapiens (Human)
Description:ChEMBL_1448940
Residue:925
BDBM50442938
NameBDBM50442938
Synonyms:CHEMBL3087159
TypeSmall organic molecule
Emp. Form.C11H19BN5O11P3
Mol. Mass.501.028
SMILESB[P@](=O)(OC[C@H]1O[C@H]([C@H](O)[C@@H]1O)n1cnc2c(N)ncnc12)OP(O)(=O)CP(O)(O)=O