Reaction Details
TargetHistone-lysine N-methyltransferase, H3 lysine-79 specific
LigandBDBM50396988
Substrate/Competitorn/a
Meas. Tech.ChEMBL_1275652 (CHEMBL3090823)
Ki 58±n/a nM
Citation Anglin, JLSong, Y A medicinal chemistry perspective for targeting histone H3 lysine-79 methyltransferase DOT1L. J Med Chem56:8972-83 (2013) 
 
Histone-lysine N-methyltransferase, H3 lysine-79 specific
Name:Histone-lysine N-methyltransferase, H3 lysine-79 specific
Type:Protein
Mol. Mass.:184911.91
Organism:Homo sapiens (Human)
Description:Q8TEK3
Residue:1537
BDBM50396988
NameBDBM50396988
Synonyms:CHEMBL2170997
TypeSmall organic molecule
Emp. Form.C21H24F3N7O4S
Mol. Mass.527.52
SMILESNc1ncnc2n(cnc12)[C@@H]1O[C@H](CSCCCNC(=O)Nc2ccc(cc2)C(F)(F)F)[C@@H](O)[C@H]1O