Reaction Details
TargetHistone-arginine methyltransferase CARM1
LigandBDBM50009672
Substrate/Competitorn/a
Meas. Tech.ChEMBL_1275651 (CHEMBL3090822)
Ki 400±n/a nM
Citation Anglin, JLSong, Y A medicinal chemistry perspective for targeting histone H3 lysine-79 methyltransferase DOT1L. J Med Chem56:8972-83 (2013) 
 
Histone-arginine methyltransferase CARM1
Name:Histone-arginine methyltransferase CARM1
Type:Protein
Mol. Mass.:65855.47
Organism:Homo sapiens (Human)
Description:Q86X55
Residue:608
BDBM50009672
NameBDBM50009672
Synonyms:AdoHcy S-(5'-adenosyl)-L-homocysteine S-[1-(adenin-9-yl)-1,5-dideoxy-beta-D-ribofuranos-5-yl]-L-homocysteine SAH US9175331, 1 | US9333217, S-Adenosyl-L-homocysteine (SAH)
TypeSmall organic molecule
Emp. Form.C14H20N6O5S
Mol. Mass.384.411
SMILESN[C@@H](CCSC[C@H]1O[C@H]([C@H](O)[C@@H]1O)n1cnc2c(N)ncnc12)C(O)=O