Reaction Details
TargetHistone-lysine N-methyltransferase, H3 lysine-79 specific
LigandBDBM50396980
Substrate/Competitorn/a
Meas. Tech.ChEMBL_1275645 (CHEMBL3090816)
EC50 9.0±n/a nM
Citation Anglin, JLSong, Y A medicinal chemistry perspective for targeting histone H3 lysine-79 methyltransferase DOT1L. J Med Chem56:8972-83 (2013) 
 
Histone-lysine N-methyltransferase, H3 lysine-79 specific
Name:Histone-lysine N-methyltransferase, H3 lysine-79 specific
Type:Protein
Mol. Mass.:184911.91
Organism:Homo sapiens (Human)
Description:Q8TEK3
Residue:1537
BDBM50396980
NameBDBM50396980
Synonyms:CHEMBL2171169
TypeSmall organic molecule
Emp. Form.C27H40N8O4
Mol. Mass.540.6577
SMILESCC(C)N(CCCNC(=O)Nc1ccc(cc1)C(C)(C)C)C[C@H]1O[C@H]([C@H](O)[C@@H]1O)n1cnc2c(N)ncnc12