Reaction Details
TargetHistone-lysine N-methyltransferase, H3 lysine-79 specific
LigandBDBM50294572
Substrate/Competitorn/a
Meas. Tech.ChEMBL_1275652 (CHEMBL3090823)
Ki 100000±n/a nM
Citation Anglin, JLSong, Y A medicinal chemistry perspective for targeting histone H3 lysine-79 methyltransferase DOT1L. J Med Chem56:8972-83 (2013) 
 
Histone-lysine N-methyltransferase, H3 lysine-79 specific
Name:Histone-lysine N-methyltransferase, H3 lysine-79 specific
Type:Protein
Mol. Mass.:184911.91
Organism:Homo sapiens (Human)
Description:Q8TEK3
Residue:1537
BDBM50294572
NameBDBM50294572
Synonyms:(2R,3R,4S,5S)-2-(6-amino-9H-purin-9-yl)-5-((3-aminopropylthio)methyl)tetrahydrofuran-3,4-diol CHEMBL538693
TypeSmall organic molecule
Emp. Form.C13H20N6O3S
Mol. Mass.340.401
SMILESNCCCSC[C@H]1O[C@H]([C@H](O)[C@@H]1O)n1cnc2c(N)ncnc12