Reaction Details
TargetHistone-lysine N-methyltransferase, H3 lysine-79 specific
LigandBDBM50375654
Substrate/Competitorn/a
Meas. Tech.ChEMBL_1275652 (CHEMBL3090823)
IC50 18000±n/a nM
Citation Anglin, JLSong, Y A medicinal chemistry perspective for targeting histone H3 lysine-79 methyltransferase DOT1L. J Med Chem56:8972-83 (2013) 
 
Histone-lysine N-methyltransferase, H3 lysine-79 specific
Name:Histone-lysine N-methyltransferase, H3 lysine-79 specific
Type:Protein
Mol. Mass.:184911.91
Organism:Homo sapiens (Human)
Description:Q8TEK3
Residue:1537
BDBM50375654
NameBDBM50375654
Synonyms:CHEMBL99203 | US11633415, Compound 5-iodotubercidin
TypeSmall organic molecule
Emp. Form.C11H13IN4O4
Mol. Mass.392.1498
SMILESNc1ncnc2n(cc(I)c12)[C@@H]1O[C@H](CO)[C@@H](O)[C@H]1O