Reaction Details
TargetHistone-lysine N-methyltransferase, H3 lysine-79 specific
LigandBDBM50443024
Substrate/Competitorn/a
Meas. Tech.ChEMBL_1275652 (CHEMBL3090823)
IC50 16000±n/a nM
Citation Anglin, JLSong, Y A medicinal chemistry perspective for targeting histone H3 lysine-79 methyltransferase DOT1L. J Med Chem56:8972-83 (2013) 
 
Histone-lysine N-methyltransferase, H3 lysine-79 specific
Name:Histone-lysine N-methyltransferase, H3 lysine-79 specific
Type:Protein
Mol. Mass.:184911.91
Organism:Homo sapiens (Human)
Description:Q8TEK3
Residue:1537
BDBM50443024
NameBDBM50443024
Synonyms:CHEMBL3087637
TypeSmall organic molecule
Emp. Form.C16H24IN7O5
Mol. Mass.521.3101
SMILESN[C@@H](CCN(CCI)C[C@H]1O[C@H]([C@H](O)[C@@H]1O)n1cnc2c(N)ncnc12)C(O)=O