Reaction Details
TargetMetabotropic glutamate receptor 5
LigandBDBM50301542
Substrate/Competitorn/a
Meas. Tech.ChEMBL_1274807 (CHEMBL3090346)
Ki 7900±n/a nM
Citation Xu, RZanotti-Fregonara, PZoghbi, SSGladding, RLWoock, AEInnis, RBPike, VW Synthesis and evaluation in monkey of [(18)F]4-fluoro-N-methyl-N-(4-(6-(methylamino)pyrimidin-4-yl)thiazol-2-yl)benzamide ([(18)F]FIMX): a promising radioligand for PET imaging of brain metabotropic glutamate receptor 1 (mGluR1). J Med Chem56:9146-55 (2013) 
 
Metabotropic glutamate receptor 5
Name:Metabotropic glutamate receptor 5
Type:Enzyme
Mol. Mass.:132484.72
Organism:Homo sapiens (Human)
Description:n/a
Residue:1212
BDBM50301542
NameBDBM50301542
Synonyms:4-fluoro-N-methyl-N-(4-(6-(methylamino)pyrimidin-4-yl)thiazol-2-yl)benzamide | CHEMBL569270
TypeSmall organic molecule
Emp. Form.C16H14FN5OS
Mol. Mass.343.379
SMILESCNc1cc(ncn1)-c1csc(n1)N(C)C(=O)c1ccc(F)cc1