Reaction Details
TargetKinesin-like protein KIF11
LigandBDBM50382559
Substrate/Competitorn/a
Meas. Tech.ChEMBL_1277307 (CHEMBL3089268)
IC50 5.0±n/a nM
Citation Dong, JJLi, QSLiu, ZPWang, SFZhao, MYYang, YHWang, XMZhu, HL Synthesis, biological evaluation and molecular docking studies of flavone and isoflavone derivatives as a novel class of KSP (kinesin spindle protein) inhibitors. Eur J Med Chem70:427-33 (2013) 
 
Kinesin-like protein KIF11
Name:Kinesin-like protein KIF11
Type:PROTEIN
Mol. Mass.:119138.97
Organism:Homo sapiens (Human)
Description:ChEMBL_1457426
Residue:1056
BDBM50382559
NameBDBM50382559
Synonyms:ISPINESIB
TypeSmall organic molecule
Emp. Form.C30H33ClN4O2
Mol. Mass.517.062
SMILESCC(C)[C@@H](N(CCCN)C(=O)c1ccc(C)cc1)c1nc2cc(Cl)ccc2c(=O)n1Cc1ccccc1