Reaction Details
TargetCyclin-T1/Cyclin-dependent kinase 9
LigandBDBM50443450
Substrate/Competitorn/a
Meas. Tech.ChEMBL_1274643 (CHEMBL3089979)
Ki 16±n/a nM
Citation Shao, HShi, SFoley, DWLam, FAbbas, AYLiu, XHuang, SJiang, XBaharin, NFischer, PMWang, S Synthesis, structure-activity relationship and biological evaluation of 2,4,5-trisubstituted pyrimidine CDK inhibitors as potential anti-tumour agents. Eur J Med Chem70:447-55 (2013) 
 
Cyclin-T1/Cyclin-dependent kinase 9
Name:Cyclin-T1/Cyclin-dependent kinase 9
Type:Protein Complex
Mol. Mass.:n/a
Description:n/a
Components:This complex has 2 components.
Component 1
Name:Cyclin-T1
Synonyms:CCNT1 CycT Cyclin T Cyclin-T
Type:Enzyme Subunit
Mol. Mass.:80712.40
Organism:Homo sapiens (Human)
Description:n/a
Residue:726
Component 2
Name:Cyclin-dependent kinase 9
Synonyms:C-2K CDK9 Cell division cycle 2-like protein kinase 4 Cyclin-Dependent Kinase 9 (CDK9) Serine/threonine-protein kinase PITALRE Tat-associated kinase complex catalytic subunit
Type:Enzyme Subunit
Mol. Mass.:42789.13
Organism:Homo sapiens (Human)
Description:n/a
Residue:372
BDBM50443450
NameBDBM50443450
Synonyms:CHEMBL3087443
TypeSmall organic molecule
Emp. Form.C19H21N7O3S2
Mol. Mass.459.545
SMILESCNc1nc(C)c(s1)-c1nc(Nc2cccc(c2)S(=O)(=O)NCCOC)ncc1C#N