Reaction Details
TargetAurora kinase B
LigandBDBM50443508
Substrate/Competitorn/a
Meas. Tech.ChEMBL_1275023 (CHEMBL3090781)
IC50 9.0±n/a nM
Citation Bavetsias, VFaisal, ACrumpler, SBrown, NKosmopoulou, MJoshi, AAtrash, BPérez-Fuertes, YSchmitt, JABoxall, KJBurke, RSun, CAvery, SBush, KHenley, ARaynaud, FIWorkman, PBayliss, RLinardopoulos, SBlagg, J Aurora isoform selectivity: design and synthesis of imidazo[4,5-b]pyridine derivatives as highly selective inhibitors of Aurora-A kinase in cells. J Med Chem56:9122-35 (2013) 
 
Aurora kinase B
Name:Aurora kinase B
Type:Protein
Mol. Mass.:39327.72
Organism:Homo sapiens (Human)
Description:Q96GD4
Residue:344
BDBM50443508
NameBDBM50443508
Synonyms:CHEMBL3087781
TypeSmall organic molecule
Emp. Form.C19H26ClN7O2S
Mol. Mass.451.973
SMILESCN(C[C@H]1CCCN(C1)c1c(Cl)cnc2nc([nH]c12)-c1cn(C)nc1C)S(C)(=O)=O