Reaction Details
TargetAurora kinase B
LigandBDBM50443494
Substrate/Competitorn/a
Meas. Tech.ChEMBL_1275023 (CHEMBL3090781)
IC50 80±n/a nM
Citation Bavetsias, VFaisal, ACrumpler, SBrown, NKosmopoulou, MJoshi, AAtrash, BPérez-Fuertes, YSchmitt, JABoxall, KJBurke, RSun, CAvery, SBush, KHenley, ARaynaud, FIWorkman, PBayliss, RLinardopoulos, SBlagg, J Aurora isoform selectivity: design and synthesis of imidazo[4,5-b]pyridine derivatives as highly selective inhibitors of Aurora-A kinase in cells. J Med Chem56:9122-35 (2013) 
 
Aurora kinase B
Name:Aurora kinase B
Type:Protein
Mol. Mass.:39327.72
Organism:Homo sapiens (Human)
Description:Q96GD4
Residue:344
BDBM50443494
NameBDBM50443494
Synonyms:CHEMBL3087776
TypeSmall organic molecule
Emp. Form.C17H20ClN7O
Mol. Mass.373.84
SMILESCC(=O)N[C@H]1CCN(C1)c1c(Cl)cnc2nc([nH]c12)-c1cn(C)nc1C