Reaction Details
TargetCell division cycle 7-related protein kinase
LigandBDBM50443642
Substrate/Competitorn/a
Meas. Tech.ChEMBL_1277971 (CHEMBL3095009)
IC50 3200±n/a nM
Citation Harrington, PEBourbeau, MPFotsch, CFrohn, MPickrell, AJReichelt, ASham, KSiegmund, ACBailis, JMBush, TEscobar, SHickman, DHeller, SHsieh, FOrf, JNRong, MSan Miguel, TTan, HZalameda, LAllen, JG The optimization of aminooxadiazoles as orally active inhibitors of Cdc7. Bioorg Med Chem Lett23:6396-400 (2013) 
 
Cell division cycle 7-related protein kinase
Name:Cell division cycle 7-related protein kinase
Type:Protein
Mol. Mass.:63908.16
Organism:Homo sapiens (Human)
Description:O00311
Residue:574
BDBM50443642
NameBDBM50443642
Synonyms:CHEMBL3093056
TypeSmall organic molecule
Emp. Form.C18H13FN4O
Mol. Mass.320.3204
SMILESFc1cc2cc(ccc2cn1)-c1nnc(NCc2ccccc2)o1