Reaction Details
TargetCyclin-dependent kinase 2/G1/S-specific cyclin-E1
LigandBDBM50443654
Substrate/Competitorn/a
Meas. Tech.ChEMBL_1277969 (CHEMBL3095007)
IC50 310±n/a nM
Citation Harrington, PEBourbeau, MPFotsch, CFrohn, MPickrell, AJReichelt, ASham, KSiegmund, ACBailis, JMBush, TEscobar, SHickman, DHeller, SHsieh, FOrf, JNRong, MSan Miguel, TTan, HZalameda, LAllen, JG The optimization of aminooxadiazoles as orally active inhibitors of Cdc7. Bioorg Med Chem Lett23:6396-400 (2013) 
 
Cyclin-dependent kinase 2/G1/S-specific cyclin-E1
Name:Cyclin-dependent kinase 2/G1/S-specific cyclin-E1
Type:Protein
Mol. Mass.:n/a
Description:n/a
Components:This complex has 2 components.
Component 1
Name:Cyclin-dependent kinase 2
Synonyms:CDK2 CDK2_HUMAN Cell division protein kinase 2 Protein cereblon/Cyclin-dependent kinase 2 | p33 protein kinase
Type:Enzyme Subunit
Mol. Mass.:33938.17
Organism:Homo sapiens (Human)
Description:P24941
Residue:298
Component 2
Name:G1/S-specific cyclin-E1
Synonyms:CCNE CCNE1_HUMAN
Type:Enzyme Subunit
Mol. Mass.:47073.17
Organism:Homo sapiens (Human)
Description:n/a
Residue:410
BDBM50443654
NameBDBM50443654
Synonyms:CHEMBL3093070
TypeSmall organic molecule
Emp. Form.C17H15N5O
Mol. Mass.305.3339
SMILESC[C@@H](Nc1nnc(o1)-c1c[nH]c2ncccc12)c1ccccc1