Reaction Details
TargetCell division cycle 7-related protein kinase
LigandBDBM50443644
Substrate/Competitorn/a
Meas. Tech.ChEMBL_1277971 (CHEMBL3095009)
IC50 32±n/a nM
Citation Harrington, PEBourbeau, MPFotsch, CFrohn, MPickrell, AJReichelt, ASham, KSiegmund, ACBailis, JMBush, TEscobar, SHickman, DHeller, SHsieh, FOrf, JNRong, MSan Miguel, TTan, HZalameda, LAllen, JG The optimization of aminooxadiazoles as orally active inhibitors of Cdc7. Bioorg Med Chem Lett23:6396-400 (2013) 
 
Cell division cycle 7-related protein kinase
Name:Cell division cycle 7-related protein kinase
Type:Protein
Mol. Mass.:63908.16
Organism:Homo sapiens (Human)
Description:O00311
Residue:574
BDBM50443644
NameBDBM50443644
Synonyms:CHEMBL3093080
TypeSmall organic molecule
Emp. Form.C18H14F2N6O
Mol. Mass.368.3402
SMILESFc1cnc2[nH]cc(-c3nnc(N[C@H](C4CC4)c4cccnc4F)o3)c2c1