Reaction Details
TargetHistamine H1 receptor
LigandBDBM27213
Substrate/Competitorn/a
Meas. Tech.ChEMBL_1280381 (CHEMBL3095541)
Ki>2512±n/a nM
Citation Wilson, DMApps, JBailey, NBamford, MJBeresford, IJBriggs, MACalver, ARCrook, BDavis, RPDavis, SDean, DKHarris, LHeightman, TDPanchal, TParr, CAQuashie, NSteadman, JGSchogger, JSehmi, SSStean, TOTakle, AKTrail, BKWhite, TWitherington, JWorby, AMedhurst, AD The discovery of the benzazepine class of histamine H3 receptor antagonists. Bioorg Med Chem Lett23:6897-901 (2013) 
 
Histamine H1 receptor
Name:Histamine H1 receptor
Type:G Protein-Coupled Receptor (GPCR)
Mol. Mass.:55808.72
Organism:Homo sapiens (Human)
Description:Cell pellets from SK-N-MC cells transfected with human H1 receptor were used in binding assay.
Residue:487
BDBM27213
NameBDBM27213
Synonyms:4-[3-(4-cyclopropanecarbonylphenoxy)propyl]-1H-imidazole CHEMBL1795025 | Ciproxifan
TypeSmall organic molecule
Emp. Form.C16H18N2O2
Mol. Mass.270.3263
SMILESO=C(C1CC1)c1ccc(OCCCc2cnc[nH]2)cc1