Reaction Details
TargetSonic hedgehog protein
LigandBDBM50443903
Substrate/Competitorn/a
Meas. Tech.ChEMBL_1277855 (CHEMBL3097789)
IC50 1.000000±n/a nM
Citation Xin, MWen, JTang, FTu, CShen, HZhao, X The discovery of novel N-(2-pyrimidinylamino) benzamide derivatives as potent hedgehog signaling pathway inhibitors. Bioorg Med Chem Lett23:6777-83 (2013) 
 
Sonic hedgehog protein
Name:Sonic hedgehog protein
Type:Protein
Mol. Mass.:47784.50
Organism:Mus musculus (Mouse)
Description:Q62226
Residue:437
BDBM50443903
NameBDBM50443903
Synonyms:CHEMBL3091565
TypeSmall organic molecule
Emp. Form.C26H21F3N4O2
Mol. Mass.478.4657
SMILESCc1ccccc1NC(=O)c1ccc(Nc2ncc(C)c(n2)-c2ccc(OC(F)(F)F)cc2)cc1