Reaction Details
TargetTyrosine-protein kinase Mer
LigandBDBM50444074
Substrate/Competitorn/a
Meas. Tech.ChEMBL_1279519 (CHEMBL3097238)
IC50 1.7±n/a nM
Citation Zhang, WZhang, DStashko, MADeRyckere, DHunter, DKireev, DMiley, MJCummings, CLee, MNorris-Drouin, JStewart, WMSather, SZhou, YKirkpatrick, GMachius, MJanzen, WPEarp, HSGraham, DKFrye, SVWang, X Pseudo-cyclization through intramolecular hydrogen bond enables discovery of pyridine substituted pyrimidines as new Mer kinase inhibitors. J Med Chem56:9683-92 (2014) 
 
Tyrosine-protein kinase Mer
Name:Tyrosine-protein kinase Mer
Type:PROTEIN
Mol. Mass.:110234.77
Organism:Homo sapiens (Human)
Description:ChEMBL_1498723
Residue:999
BDBM50444074
NameBDBM50444074
Synonyms:CHEMBL3092791
TypeSmall organic molecule
Emp. Form.C22H34N6O
Mol. Mass.398.545
SMILESCCCCNc1ncc(c(N[C@H]2CC[C@H](O)CC2)n1)-c1ccc(CN(C)C)cn1