Reaction Details
TargetEndothelial lipase
LigandBDBM50444141
Substrate/Competitorn/a
Meas. Tech.ChEMBL_1280886 (CHEMBL3095184)
IC50 130±n/a nM
Citation Sun, SDean, RJia, QZenova, AZhong, JGrayson, CXie, CLindgren, ASamra, PSojo, Lvan Heek, MLin, LPercival, DFu, JMWinther, MDZhang, Z Discovery of XEN445: a potent and selective endothelial lipase inhibitor raises plasma HDL-cholesterol concentration in mice. Bioorg Med Chem21:7724-34 (2013) 
 
Endothelial lipase
Name:Endothelial lipase
Type:Protein
Mol. Mass.:56805.62
Organism:Homo sapiens (Human)
Description:Q9Y5X9
Residue:500
BDBM50444141
NameBDBM50444141
Synonyms:CHEMBL3093393
TypeSmall organic molecule
Emp. Form.C18H16F4N2O3
Mol. Mass.384.3249
SMILESOC(=O)c1cc(ccc1N1CC[C@@H](C1)OCc1ccc(F)cn1)C(F)(F)F