Reaction Details
TargetTyrosine-protein kinase Mer
LigandBDBM50444241
Substrate/Competitorn/a
Meas. Tech.ChEMBL_1277932 (CHEMBL3094776)
IC50 4.3±n/a nM
Citation Zhang, WMcIver, ALStashko, MADeRyckere, DBranchford, BRHunter, DKireev, DMiley, MJNorris-Drouin, JStewart, WMLee, MSather, SZhou, YDi Paola, JAMachius, MJanzen, WPEarp, HSGraham, DKFrye, SVWang, X Discovery of Mer specific tyrosine kinase inhibitors for the treatment and prevention of thrombosis. J Med Chem56:9693-700 (2014) 
 
Tyrosine-protein kinase Mer
Name:Tyrosine-protein kinase Mer
Type:PROTEIN
Mol. Mass.:110234.77
Organism:Homo sapiens (Human)
Description:ChEMBL_1498723
Residue:999
BDBM50444241
NameBDBM50444241
Synonyms:CHEMBL3093756 | US9649309, Compound UNC2881A
TypeSmall organic molecule
Emp. Form.C25H33N7O2
Mol. Mass.463.5752
SMILESCCCCNc1ncc(C(=O)NCc2ccc(cc2)-n2ccnc2)c(N[C@H]2CC[C@H](O)CC2)n1