Reaction Details
TargetTyrosine-protein kinase receptor TYRO3
LigandBDBM50444242
Substrate/Competitorn/a
Meas. Tech.ChEMBL_1277930 (CHEMBL3094774)
IC50 280±n/a nM
Citation Zhang, WMcIver, ALStashko, MADeRyckere, DBranchford, BRHunter, DKireev, DMiley, MJNorris-Drouin, JStewart, WMLee, MSather, SZhou, YDi Paola, JAMachius, MJanzen, WPEarp, HSGraham, DKFrye, SVWang, X Discovery of Mer specific tyrosine kinase inhibitors for the treatment and prevention of thrombosis. J Med Chem56:9693-700 (2014) 
 
Tyrosine-protein kinase receptor TYRO3
Name:Tyrosine-protein kinase receptor TYRO3
Type:Protein
Mol. Mass.:96894.13
Organism:Homo sapiens (Human)
Description:Q06418
Residue:890
BDBM50444242
NameBDBM50444242
Synonyms:CHEMBL3093755
TypeSmall organic molecule
Emp. Form.C22H32N6O4S
Mol. Mass.476.592
SMILESCCCCNc1ncc(C(=O)NCc2ccc(cc2)S(N)(=O)=O)c(N[C@H]2CC[C@H](O)CC2)n1