Reaction Details
TargetDual specificity tyrosine-phosphorylation-regulated kinase 1A
LigandBDBM50444360
Substrate/Competitorn/a
Meas. Tech.ChEMBL_1279586 (CHEMBL3097668)
IC50 13±n/a nM
Citation Anderson, KChen, YChen, ZDominique, RGlenn, KHe, YJanson, CLuk, KCLukacs, CPolonskaia, AQiao, QRailkar, ARossman, PSun, HXiang, QVilenchik, MWovkulich, PZhang, X Pyrido[2,3-d]pyrimidines: discovery and preliminary SAR of a novel series of DYRK1B and DYRK1A inhibitors. Bioorg Med Chem Lett23:6610-5 (2013) 
 
Dual specificity tyrosine-phosphorylation-regulated kinase 1A
Name:Dual specificity tyrosine-phosphorylation-regulated kinase 1A
Type:Enzyme
Mol. Mass.:85616.61
Organism:Homo sapiens (Human)
Description:Q13627
Residue:763
BDBM50444360
NameBDBM50444360
Synonyms:CHEMBL3094435
TypeSmall organic molecule
Emp. Form.C31H36ClN9O3
Mol. Mass.618.129
SMILESCN1CCN(CCNc2ncc3cc(C(=O)Nc4cc(ccc4Cl)C(=O)NC(CCN)c4ccccc4)c(=O)[nH]c3n2)CC1