Reaction Details
TargetDual specificity tyrosine-phosphorylation-regulated kinase 1B
LigandBDBM50444356
Substrate/Competitorn/a
Meas. Tech.ChEMBL_1279587 (CHEMBL3097669)
IC50 101±n/a nM
Citation Anderson, KChen, YChen, ZDominique, RGlenn, KHe, YJanson, CLuk, KCLukacs, CPolonskaia, AQiao, QRailkar, ARossman, PSun, HXiang, QVilenchik, MWovkulich, PZhang, X Pyrido[2,3-d]pyrimidines: discovery and preliminary SAR of a novel series of DYRK1B and DYRK1A inhibitors. Bioorg Med Chem Lett23:6610-5 (2013) 
 
Dual specificity tyrosine-phosphorylation-regulated kinase 1B
Name:Dual specificity tyrosine-phosphorylation-regulated kinase 1B
Type:Enzyme
Mol. Mass.:69222.24
Organism:Homo sapiens (Human)
Description:Q9Y463
Residue:629
BDBM50444356
NameBDBM50444356
Synonyms:CHEMBL3094439
TypeSmall organic molecule
Emp. Form.C26H25ClN6O4
Mol. Mass.520.968
SMILESCOc1nc(C)c2cc(C(=O)Nc3cc(ccc3Cl)C(=O)NC(CCN)c3ccccc3)c(=O)[nH]c2n1