Reaction Details
TargetDual specificity tyrosine-phosphorylation-regulated kinase 1B
LigandBDBM50444359
Substrate/Competitorn/a
Meas. Tech.ChEMBL_1279587 (CHEMBL3097669)
IC50 26±n/a nM
Citation Anderson, KChen, YChen, ZDominique, RGlenn, KHe, YJanson, CLuk, KCLukacs, CPolonskaia, AQiao, QRailkar, ARossman, PSun, HXiang, QVilenchik, MWovkulich, PZhang, X Pyrido[2,3-d]pyrimidines: discovery and preliminary SAR of a novel series of DYRK1B and DYRK1A inhibitors. Bioorg Med Chem Lett23:6610-5 (2013) 
 
Dual specificity tyrosine-phosphorylation-regulated kinase 1B
Name:Dual specificity tyrosine-phosphorylation-regulated kinase 1B
Type:Enzyme
Mol. Mass.:69222.24
Organism:Homo sapiens (Human)
Description:Q9Y463
Residue:629
BDBM50444359
NameBDBM50444359
Synonyms:CHEMBL3094436
TypeSmall organic molecule
Emp. Form.C29H31ClN8O3
Mol. Mass.575.061
SMILESNCCC(NC(=O)c1ccc(Cl)c(NC(=O)c2cc3cnc(nc3[nH]c2=O)N2CCC(N)CC2)c1)c1ccccc1