Reaction Details
TargetDual specificity tyrosine-phosphorylation-regulated kinase 1B
LigandBDBM50444387
Substrate/Competitorn/a
Meas. Tech.ChEMBL_1279587 (CHEMBL3097669)
IC50 560±n/a nM
Citation Anderson, KChen, YChen, ZDominique, RGlenn, KHe, YJanson, CLuk, KCLukacs, CPolonskaia, AQiao, QRailkar, ARossman, PSun, HXiang, QVilenchik, MWovkulich, PZhang, X Pyrido[2,3-d]pyrimidines: discovery and preliminary SAR of a novel series of DYRK1B and DYRK1A inhibitors. Bioorg Med Chem Lett23:6610-5 (2013) 
 
Dual specificity tyrosine-phosphorylation-regulated kinase 1B
Name:Dual specificity tyrosine-phosphorylation-regulated kinase 1B
Type:Enzyme
Mol. Mass.:69222.24
Organism:Homo sapiens (Human)
Description:Q9Y463
Residue:629
BDBM50444387
NameBDBM50444387
Synonyms:CHEMBL3094440
TypeSmall organic molecule
Emp. Form.C21H20N2O6
Mol. Mass.396.3933
SMILESCOC(=O)c1ccc(C)c(NC(=O)c2cc3cc(OC)c(OC)cc3[nH]c2=O)c1