Reaction Details
TargetSuppressor of tumorigenicity 14 protein
LigandBDBM50038002
Substrate/Competitorn/a
Meas. Tech.ChEMBL_1281386 (CHEMBL3101481)
Ki 400000±n/a nM
Citation Goswami, RMukherjee, SWohlfahrt, GGhadiyaram, CNagaraj, JChandra, BRSistla, RKSatyam, LKSamiulla, DSMoilanen, ASubramanya, HSRamachandra, M Discovery of Pyridyl Bis(oxy)dibenzimidamide Derivatives as Selective Matriptase Inhibitors. ACS Med Chem Lett4:1152-7 (2013) 
 
Suppressor of tumorigenicity 14 protein
Name:Suppressor of tumorigenicity 14 protein
Type:Single-pass type II membrane protein
Mol. Mass.:94769.23
Organism:Homo sapiens (Human)
Description:Q9Y5Y6
Residue:855
BDBM50038002
NameBDBM50038002
Synonyms:Benzamidine (Protonated) CHEMBL537204 | benzamidine
TypeSmall organic molecule
Emp. Form.C7H8N2
Mol. Mass.120.1518
SMILESNC(=N)c1ccccc1