Reaction Details
TargetPoly [ADP-ribose] polymerase tankyrase-2
LigandBDBM50444545
Substrate/Competitorn/a
Meas. Tech.ChEMBL_1281548 (CHEMBL3102114)
IC50 6.7±n/a nM
Citation Nathubhai, AWood, PJLloyd, MDThompson, ASThreadgill, MD Design and Discovery of 2-Arylquinazolin-4-ones as Potent and Selective Inhibitors of Tankyrases. ACS Med Chem Lett4:1173-7 (2013) 
 
Poly [ADP-ribose] polymerase tankyrase-2
Name:Poly [ADP-ribose] polymerase tankyrase-2
Type:Enzyme
Mol. Mass.:126937.16
Organism:Homo sapiens (Human)
Description:Q9H2K2
Residue:1166
BDBM50444545
NameBDBM50444545
Synonyms:CHEMBL3098940
TypeSmall organic molecule
Emp. Form.C16H14N2O
Mol. Mass.250.2952
SMILESCc1ccc(cc1)-c1nc2c(C)cccc2c(=O)[nH]1