Reaction Details
TargetKallikrein-7
LigandBDBM50444603
Substrate/Competitorn/a
Meas. Tech.ChEMBL_1282442 (CHEMBL3100743)
Ki 75000±n/a nM
Citation Tan, XBertonati, CQin, LFurio, LEl Amri, CHovnanian, AReboud-Ravaux, MVilloutreix, BO Identification by in silico and in vitro screenings of small organic molecules acting as reversible inhibitors of kallikreins. Eur J Med Chem70:661-8 (2013) 
 
Kallikrein-7
Name:Kallikrein-7
Type:PROTEIN
Mol. Mass.:27535.05
Organism:Homo sapiens (Human)
Description:ChEMBL_1469257
Residue:253
BDBM50444603
NameBDBM50444603
Synonyms:CHEMBL3099871
TypeSmall organic molecule
Emp. Form.C18H16N2O4
Mol. Mass.324.3306
SMILESCCOc1cc(\C=C(\C#N)C(=O)Nc2ccc(O)cc2)ccc1O