Reaction Details
TargetKallikrein-5 [D153N]
LigandBDBM50444602
Substrate/Competitorn/a
Meas. Tech.ChEMBL_1282444 (CHEMBL3100871)
Ki 100000±n/a nM
Citation Tan, XBertonati, CQin, LFurio, LEl Amri, CHovnanian, AReboud-Ravaux, MVilloutreix, BO Identification by in silico and in vitro screenings of small organic molecules acting as reversible inhibitors of kallikreins. Eur J Med Chem70:661-8 (2013) 
 
Kallikrein-5 [D153N]
Name:Kallikrein-5 [D153N]
Type:PROTEIN
Mol. Mass.:32031.75
Organism:Homo sapiens (Human)
Description:ChEMBL_1282456
Residue:293
BDBM50444602
NameBDBM50444602
Synonyms:CHEMBL3099874
TypeSmall organic molecule
Emp. Form.C18H16N2O4
Mol. Mass.324.3306
SMILESCOc1ccc(NC(=O)C(=C/c2ccc(O)c(OC)c2)\C#N)cc1