Reaction Details
TargetKallikrein-5 [D153N]
LigandBDBM50444603
Substrate/Competitorn/a
Meas. Tech.ChEMBL_1282444 (CHEMBL3100871)
Ki 107000±n/a nM
Citation Tan, XBertonati, CQin, LFurio, LEl Amri, CHovnanian, AReboud-Ravaux, MVilloutreix, BO Identification by in silico and in vitro screenings of small organic molecules acting as reversible inhibitors of kallikreins. Eur J Med Chem70:661-8 (2013) 
 
Kallikrein-5 [D153N]
Name:Kallikrein-5 [D153N]
Type:PROTEIN
Mol. Mass.:32031.75
Organism:Homo sapiens (Human)
Description:ChEMBL_1282456
Residue:293
BDBM50444603
NameBDBM50444603
Synonyms:CHEMBL3099871
TypeSmall organic molecule
Emp. Form.C18H16N2O4
Mol. Mass.324.3306
SMILESCCOc1cc(\C=C(\C#N)C(=O)Nc2ccc(O)cc2)ccc1O