Reaction Details
TargetNicotinamide phosphoribosyltransferase
LigandBDBM50444655
Substrate/Competitorn/a
Meas. Tech.ChEMBL_1281258 (CHEMBL3100993)
IC50 0.600000±n/a nM
Citation Zheng, XBaumeister, TBuckmelter, AJCaligiuri, MClodfelter, KHHan, BHo, YCKley, NLin, JReynolds, DJSharma, GSmith, CCWang, ZDragovich, PSOh, AWang, WZak, MWang, YYuen, PWBair, KW Discovery of potent and efficacious cyanoguanidine-containing nicotinamide phosphoribosyltransferase (Nampt) inhibitors. Bioorg Med Chem Lett24:337-43 (2013) 
 
Nicotinamide phosphoribosyltransferase
Name:Nicotinamide phosphoribosyltransferase
Type:Enzyme
Mol. Mass.:55524.98
Organism:Homo sapiens (Human)
Description:P43490
Residue:491
BDBM50444655
NameBDBM50444655
Synonyms:CHEMBL3098518
TypeSmall organic molecule
Emp. Form.C20H15F2N5O2S
Mol. Mass.427.427
SMILESFc1cc(F)cc(c1)S(=O)(=O)c1ccc(CNC(NC#N)=Nc2ccncc2)cc1