Reaction Details
TargetMandelate racemase
LigandBDBM81768
Substrate/Competitorn/a
Meas. Tech.ChEMBL_1282684 (CHEMBL3101731)
Ki 700000±n/a nM
Citation Harty, MNagar, MAtkinson, LLegay, CMDerksen, DJBearne, SL Inhibition of serine and proline racemases by substrate-product analogues. Bioorg Med Chem Lett24:390-3 (2013) 
 
Mandelate racemase
Name:Mandelate racemase
Type:Protein
Mol. Mass.:38561.77
Organism:Pseudomonas putida (g-Proteobacteria)
Description:n/a
Residue:359
BDBM81768
NameBDBM81768
Synonyms:BENZYLIC ACID NSC_5311391 | Quinuclidinyl benzilate
TypeSmall organic molecule
Emp. Form.C14H12O3
Mol. Mass.228.2433
SMILESOC(=O)C(O)(c1ccccc1)c1ccccc1