Reaction Details
TargetProteasome subunit beta type-1
LigandBDBM50444907
Substrate/Competitorn/a
Meas. Tech.ChEMBL_1282983 (CHEMBL3100302)
IC50 870±n/a nM
Citation Hasegawa, MYasuda, YTanaka, MNakata, KUmeda, EWang, YWatanabe, CUetake, SKunoh, TShionyu, MSasaki, RShiina, IMizukami, T A novel tamoxifen derivative, ridaifen-F, is a nonpeptidic small-molecule proteasome inhibitor. Eur J Med Chem71:290-305 (2014) 
 
Proteasome subunit beta type-1
Name:Proteasome subunit beta type-1
Type:PROTEIN
Mol. Mass.:26493.62
Organism:Homo sapiens (Human)
Description:ChEMBL_1366691
Residue:241
BDBM50444907
NameBDBM50444907
Synonyms:CHEMBL3099623
TypeSmall organic molecule
Emp. Form.C37H48N2O2
Mol. Mass.552.7892
SMILES[#6]\[#6](=[#6](/c1ccc(-[#8]-[#6]-[#6]-[#7]-2-[#6]-[#6]-[#6]-[#6]-[#6]-[#6]-2)cc1)-c1ccc(-[#8]-[#6]-[#6]-[#7]-2-[#6]-[#6]-[#6]-[#6]-[#6]-[#6]-2)cc1)-c1ccccc1