Reaction Details
TargetProteasome subunit beta type-1
LigandBDBM50444889
Substrate/Competitorn/a
Meas. Tech.ChEMBL_1282983 (CHEMBL3100302)
IC50 350±n/a nM
Citation Hasegawa, MYasuda, YTanaka, MNakata, KUmeda, EWang, YWatanabe, CUetake, SKunoh, TShionyu, MSasaki, RShiina, IMizukami, T A novel tamoxifen derivative, ridaifen-F, is a nonpeptidic small-molecule proteasome inhibitor. Eur J Med Chem71:290-305 (2014) 
 
Proteasome subunit beta type-1
Name:Proteasome subunit beta type-1
Type:PROTEIN
Mol. Mass.:26493.62
Organism:Homo sapiens (Human)
Description:ChEMBL_1366691
Residue:241
BDBM50444889
NameBDBM50444889
Synonyms:CHEMBL3099620
TypeSmall organic molecule
Emp. Form.C42H56N2O2
Mol. Mass.620.9062
SMILES[#6](-[#6]-[#7]-1-[#6]-[#6]-[#6]-[#6]-[#6]-[#6]-1)-[#8]-c1ccc(cc1)-[#6](=[#6](/[#6]-1-[#6]-[#6]-[#6]-[#6]-[#6]1)-c1ccccc1)\c1ccc(-[#8]-[#6]-[#6]-[#7]-2-[#6]-[#6]-[#6]-[#6]-[#6]-[#6]-2)cc1